{"text_format":"1","workbook":"xlsx","n_sheets":7,"sheets":["Accueil","Outils_de_calcul_ETP","Paramétres","Aide calcul MP","Résultats numériques","Résultats graphiques","Feuil-cachée"],"not_rendered":{"charts":2,"images":21,"macros":1,"external_links":0,"defined_names":1,"comments":1,"pivot_tables":2},"unopened":[],"bounds":{"document_bytes":16777216,"sheet_cells":100000,"rows_first":2000,"rows_last":500,"rows_between":2000,"halvings":0,"cell_chars":16384,"cell_head_chars":4096},"cells_cut":0,"cells_raw":0,"read":"whole","date_system":"1900"}

{"sheet":"Accueil","index":0,"n_rows":21,"n_cols":17,"rows_kept":21,"cut":false,"hidden":false,"merged":[[20,16,23,17],[2,2,29,13]]}
[]
[null,null,"Mode d'emploi de l'outil de calcul ETP de maintenance préventive:"]
[null,null,"En appuyant sur le bouton \"Démarrer\"      , vous arriverez sur la page \"Outils_de calcul_ETP\" ou vous trouverez un tableau composé de deux parties:\n* La première partie dispose d'une liste de famille et d’équipements prédéfinis. Ils sont présents dans la majorité des établissements et ne sont pas modifiables dans l’outil.\n* La seconde partie est vide, permettant à l’utilisateur d'ajouter jusqu’à 32 dispositifs supplémentaires de son choix et également de l’associer à une des familles prédéfinies dans le logiciel.\n\nPour chaque DM renseigner sur ce tableau, l’utilisateur devra renseigner plusieurs colonnes:\n • Si le DM est à maintenir.                                                                      • La périodicité de maintenance préventive.                  • le lieu de prise en charge de l’équipement.\n • Le type de maintenance                                                                       • Le nombre de dispositifs.                                                 • le temps de maintenance préventive. (Possibilité d'utiliser l’aide de calcul MP)\n • Variable de temps supplémentaire (Possibilité de rajouter du temps selon les spécificités géographique, technique,... du DM)\n\n            Page « Aide calcul temps de MP », permet d’estimer le temps de maintenance préventive selon plusieurs critères pouvant être reporté dans la page “Outils de calcul du temps ETP”. \n•Contrôle Qualité.                                                                                      •Procédure d’hygiène.                                                           • Commande des kits de maintenance préventive.\n•Remplacement du kit de maintenance préventive.                   •Gestion administrative.                                                      •Décartonnage et valorisation des déchets.             \n\n           Page « Résultats numériques », représente:\n•le temps ETP par dispositifs                                                                                                                        •Le temps ETP pour l'ensemble du parc et des dispositifs maintenus.\n•Le nombre de techniciens nécessaire pour pouvoir réaliser la maintenance préventive de l'ensemble du parc de dispositifs médicaux.\n\n           Page “Résultats graphiques”, donne:\n• La représentation du nombre d’heures de maintenance par dispositifs médicaux.                       • La répartition du temps de maintenance préventive en fonction des familles de dispositifs médicaux.\n\n           Page « Paramètres », les utilisateurs pourront renseigner ou modifier:\nLe temps en pourcentage du type de maintenance.                         le temps estimé de prise en charge en fonction du lieu d’intervention.           Le temps annuel d’un technicien biomédical.\n• Externalisation: 5% (de base).                                                                 • Service de soins: 0,5 heure (de base)                                                                             • Temps: 1580 heures (de base)\n• Partagée: 50% (de base).                                                                           • Atelier biomédical: 0,25 heure (de base)\n                                                                                                                                 • Site extérieur: 1 heures (de base)\n            Icône \"imprimante\": permet sur les pages ou l'icone est présente d'imprimer les données affichées à l'écran au format adéquat."]
[]
[]
[]
[]
[]
[]
[]
[]
[]
[]
[]
[]
[]
[]
[]
[]
[]
{"$rows_left_out":2}
{"sheet":"Outils_de_calcul_ETP","index":1,"n_rows":36,"n_cols":10,"rows_kept":36,"cut":false,"hidden":false,"merged":[[3,1,3,9],[31,1,35,1],[28,1,30,1],[12,1,17,1],[5,1,11,1],[18,1,20,1],[26,1,27,1],[21,1,25,1]]}
[]
[]
[]
[null,"Dispositifs médicaux de l'outil"]
[null,"Famille de dispositifs\n médicaux","Dispositifs médicaux de l'outil","Dispositifs médicaux à maintenir","Type de maintenance","Lieu d'intervention","Temps de\nmaintenance\npréventive\n(en heure)","Périodicité\n(MP/AN)","Nbre \nd'équipement","Variable de temps supplémentaire"]
[null,"Ventilation","Respirateur d'anesthésie"]
[null,null,"Respirateur de transport"]
[null,null,"Respirateur de SSPI"]
[null,null,"Respirateur de réanimation"]
[null,null,"Respirateur pédiatrique/néonat"]
[null,null,"Cuves halogénées"]
[null,null,"Module gaz (Capno)"]
[null,"Monitorage","Tensiomètre / SPO2"]
[null,null,"Monitorage"]
[null,null,"Centrale de monitorage"]
[null,null,"Télémétrie/holter"]
[null,null,"Cardiotochographe"]
[null,null,"Défibrillateur"]
[null,"Dialyse","Traitement d'eau de dialyse"]
[null,null,"Générateurs de dialyse"]
{"$rows_left_out":17}
{"sheet":"Paramétres","index":2,"n_rows":18,"n_cols":18,"rows_kept":18,"cut":false,"hidden":false,"merged":[[4,2,5,3],[5,4,5,5],[8,2,10,3]]}
[]
[null,null,"Personnalisation de l'outil:"]
[null,null,"Temps annuel d'un technicien biomédical:",null,null,null,1580,"Heures"]
[]
[null,null,"Type de maintenance",null,"Externalisée",null,0.05,"%"]
[null,null,null,null,"Partagée",null,0.5,"%"]
[]
[]
[null,null,"Lieu d'intervention",null,"Service de soins",null,0.5,"Heures(s)",null,null,null,null,null,"                  Notre équipe"]
[null,null,null,null,"Atelier Biomédical",null,0.25,"Heure(S)"]
[null,null,null,null,"Site externe",null,1,"Heure(S)"]
[]
[]
[null,null,"Parcours:"]
[null,null,"Master 2 Ingénierie de la santé - Technologie biomédical et territoires de santé"]
[null,null,"Formation continue - Responsables d’ateliers biomédicaux"]
[null,null,"https://doi.org/10.34756/ids211"]
[null,null," https://travaux.master.utc.fr/formations-master/ingenierie-de-la-sante/ids211",null,null,null,null,null,null,null,null,null,null,"François Lecoutour",null,"David Soubirous",null,"Emmanuel Laporte"]

{"sheet":"Aide calcul MP","index":3,"n_rows":26,"n_cols":9,"rows_kept":26,"cut":false,"hidden":false,"merged":[[5,1,5,6],[5,8,6,8],[10,1,10,4],[10,5,10,6],[10,8,15,8],[14,1,14,3],[14,4,14,5]]}
[]
[]
[]
[]
[]
[null,"Temps de maintenance préventive détaillé (en heure)",null,null,null,null,null,null,"Forfait temps de\nmaintenance préventice"]
[null,"Conrôle Qualité","Remplacement kit MP","Nettoyage et desinfection du dispositif","Temps de commande des kits MP","Décartonage et valorisation des déchets","Gestion administrative (GMAO)"]
[null,null,null,null,null,null,null,null,{"$f":"VLOOKUP(I26,'Feuil-cachée'!C$48:D$156,2,0)","v":0}]
[]
[]
[null,"PREPARATION A LA MAINTENANCE",null,null,null,"MAINTENANCE",null,null,"Tableau des temps médians repris du groupe de travail de la formation ABIH 2023\nSuite à une enquête auprès de 30 services biomédicaux"]
[null,"Commande de pièces détachées du DM","Création d'un protocole de contrôle","Formation du personnel sur le DM","Soutien logiciel","Consultation des manuels cliniques et techniques ","Nettoyage de l'appareil"]
[null,1.5,3,3.5,0.2,0.1,0.08]
[]
[null,"SOUTIEN LOGISTIQUE INTÉGRÉ",null,null,"REGISTRE SECU QUALITE MAINTENANCE"]
[null,"Identification des DM à contrôler ","Communication avec le service","Recuperation du DM"," Récupération de la fiche d'intervention  ","Enregistrer le compte-rendu contrôle "]
[null,0.05,0.15,0.25,7.0000000000000007E-2,7.0000000000000007E-2,null,null,"https://abih.utc.fr/projets/abih-23-03/"]
[]
[]
[]
{"$rows_left_out":7}
{"sheet":"Résultats numériques","index":4,"n_rows":71,"n_cols":28,"rows_kept":71,"cut":false,"hidden":false,"merged":[[2,1,7,1],[2,2,7,2],[2,3,7,3],[2,5,7,5],[2,6,7,6],[2,7,7,7],[2,8,7,8],[2,9,7,9],[2,10,7,10],[7,12,7,14],[2,12,3,13],[2,14,3,14],[4,12,5,13],[4,14,5,14],[6,12,6,14]]}
[]
[]
[null,"Famille de\n dispositifs médicaux","Type de dispositifs médicaux","Nombres","Type de MP\n(Internalisée/externalisée/Partagée)\nen %","Périodicité\nMP/AN","Tps passé pour 1 MP + Gestion\nen heure","Temps de prise en charge des DM\nen heure","Variable de temps supplémentaire","Tps Total en Heures","Soit en ETP",null,"Temps total pour la MP global du parc de DM",null,{"$f":"SUM(J9:J71)","v":0}]
[]
[null,null,null,null,null,null,null,null,null,null,null,null,"Nombre d'heures travaillés/tech",null,{"$f":"Paramétres!G3","v":1580}]
[]
[null,null,null,null,null,null,null,null,null,null,null,null,"Nombre de techicien nécéssaire pour réaliser la MP"]
[null,null,null,null,null,null,null,null,null,null,null,null,{"$f":"(O3/O5)","v":0}]
[null,"Ventilation",{"$f":"IF(Outils_de_calcul_ETP!D6=\"OUI\",Outils_de_calcul_ETP!C6,0)","v":0},{"$f":"IF(C9>0,Outils_de_calcul_ETP!I6,)","v":0},{"$f":"_xlfn.IFS(Outils_de_calcul_ETP!E6=\"Externalisée\",Paramétres!G$5,Outils_de_calcul_ETP!E6=\"Internalisée\",1,Outils_de_calcul_ETP!E6=\"Partagée\",Paramétres!G$6,Outils_de_calcul_ETP!E6=\"NON\",0,Outils_de_calcul_ETP!E6=\"\",0)","v":0},{"$f":"IF(C9<>0, IFERROR(INDEX(Outils_de_calcul_ETP!H:H, MATCH(C9, Outils_de_calcul_ETP!C:C, 0)), 0), 0)","v":0},{"$f":"IFERROR(IF(C9<>0, INDEX(Outils_de_calcul_ETP!G:G, MATCH(C9, Outils_de_calcul_ETP!C:C, 0)), IF(C9=0, 0)), 0)","v":0},{"$f":"_xlfn.IFS(Outils_de_calcul_ETP!F6=\"Atelier biomédical\",Paramétres!G$10,Outils_de_calcul_ETP!F6=\"Service de soins\",Paramétres!G$9,Outils_de_calcul_ETP!F6=\"Site extérieur\",Paramétres!G$11,Outils_de_calcul_ETP!F6=\"NON\",0,Outils_de_calcul_ETP!F6=\"\",0)*D9","v":0},{"$f":"Outils_de_calcul_ETP!J6","v":0},{"$f":"(D9*F9*G9*E9)+I9+H9","v":0},{"$f":"(J9/O$5)","v":0}]
[null,"Ventilation",{"$f":"IF(Outils_de_calcul_ETP!D7=\"OUI\",Outils_de_calcul_ETP!C7,0)","v":0},{"$f":"IF(C10>0,Outils_de_calcul_ETP!I7,)","v":0},{"$f":"_xlfn.IFS(Outils_de_calcul_ETP!E7=\"Externalisée\",Paramétres!G$5,Outils_de_calcul_ETP!E7=\"Internalisée\",1,Outils_de_calcul_ETP!E7=\"Partagée\",Paramétres!G$6,Outils_de_calcul_ETP!E7=\"NON\",0,Outils_de_calcul_ETP!E7=\"\",0)","v":0},{"$f":"IF(C10<>0, IFERROR(INDEX(Outils_de_calcul_ETP!H:H, MATCH(C10, Outils_de_calcul_ETP!C:C, 0)), 0), 0)","v":0},{"$f":"IFERROR(IF(C10<>0, INDEX(Outils_de_calcul_ETP!G:G, MATCH(C10, Outils_de_calcul_ETP!C:C, 0)), IF(C10=0, 0)), 0)","v":0},{"$f":"_xlfn.IFS(Outils_de_calcul_ETP!F7=\"Atelier biomédical\",Paramétres!G$10,Outils_de_calcul_ETP!F7=\"Service de soins\",Paramétres!G$9,Outils_de_calcul_ETP!F7=\"Site extérieur\",Paramétres!G$11,Outils_de_calcul_ETP!F7=\"NON\",0,Outils_de_calcul_ETP!F7=\"\",0)*D10","v":0},{"$f":"Outils_de_calcul_ETP!J7","v":0},{"$f":"(D10*F10*G10*E10)+I10+H10","v":0},0,null,null,null,null,null,null,null,null,null,null,null,null,null,null,null,null,true]
[null,"Ventilation",{"$f":"IF(Outils_de_calcul_ETP!D8=\"OUI\",Outils_de_calcul_ETP!C8,0)","v":0},{"$f":"IF(C11>0,Outils_de_calcul_ETP!I8,)","v":0},{"$f":"_xlfn.IFS(Outils_de_calcul_ETP!E8=\"Externalisée\",Paramétres!G$5,Outils_de_calcul_ETP!E8=\"Internalisée\",1,Outils_de_calcul_ETP!E8=\"Partagée\",Paramétres!G$6,Outils_de_calcul_ETP!E8=\"NON\",0,Outils_de_calcul_ETP!E8=\"\",0)","v":0},{"$f":"IF(C11<>0, IFERROR(INDEX(Outils_de_calcul_ETP!H:H, MATCH(C11, Outils_de_calcul_ETP!C:C, 0)), 0), 0)","v":0},{"$f":"IFERROR(IF(C11<>0, INDEX(Outils_de_calcul_ETP!G:G, MATCH(C11, Outils_de_calcul_ETP!C:C, 0)), IF(C11=0, 0)), 0)","v":0},{"$f":"_xlfn.IFS(Outils_de_calcul_ETP!F8=\"Atelier biomédical\",Paramétres!G$10,Outils_de_calcul_ETP!F8=\"Service de soins\",Paramétres!G$9,Outils_de_calcul_ETP!F8=\"Site extérieur\",Paramétres!G$11,Outils_de_calcul_ETP!F8=\"NON\",0,Outils_de_calcul_ETP!F8=\"\",0)*D11","v":0},{"$f":"Outils_de_calcul_ETP!J8","v":0},0,0]
[null,"Ventilation",{"$f":"IF(Outils_de_calcul_ETP!D9=\"OUI\",Outils_de_calcul_ETP!C9,0)","v":0},{"$f":"IF(C12>0,Outils_de_calcul_ETP!I9,)","v":0},{"$f":"_xlfn.IFS(Outils_de_calcul_ETP!E9=\"Externalisée\",Paramétres!G$5,Outils_de_calcul_ETP!E9=\"Internalisée\",1,Outils_de_calcul_ETP!E9=\"Partagée\",Paramétres!G$6,Outils_de_calcul_ETP!E9=\"NON\",0,Outils_de_calcul_ETP!E9=\"\",0)","v":0},{"$f":"IF(C12<>0, IFERROR(INDEX(Outils_de_calcul_ETP!H:H, MATCH(C12, Outils_de_calcul_ETP!C:C, 0)), 0), 0)","v":0},{"$f":"IFERROR(IF(C12<>0, INDEX(Outils_de_calcul_ETP!G:G, MATCH(C12, Outils_de_calcul_ETP!C:C, 0)), IF(C12=0, 0)), 0)","v":0},{"$f":"_xlfn.IFS(Outils_de_calcul_ETP!F9=\"Atelier biomédical\",Paramétres!G$10,Outils_de_calcul_ETP!F9=\"Service de soins\",Paramétres!G$9,Outils_de_calcul_ETP!F9=\"Site extérieur\",Paramétres!G$11,Outils_de_calcul_ETP!F9=\"NON\",0,Outils_de_calcul_ETP!F9=\"\",0)*D12","v":0},{"$f":"Outils_de_calcul_ETP!J9","v":0},0,0]
[null,"Ventilation",{"$f":"IF(Outils_de_calcul_ETP!D10=\"OUI\",Outils_de_calcul_ETP!C10,0)","v":0},{"$f":"IF(C13>0,Outils_de_calcul_ETP!I10,)","v":0},{"$f":"_xlfn.IFS(Outils_de_calcul_ETP!E10=\"Externalisée\",Paramétres!G$5,Outils_de_calcul_ETP!E10=\"Internalisée\",1,Outils_de_calcul_ETP!E10=\"Partagée\",Paramétres!G$6,Outils_de_calcul_ETP!E10=\"NON\",0,Outils_de_calcul_ETP!E10=\"\",0)","v":0},{"$f":"IF(C13<>0, IFERROR(INDEX(Outils_de_calcul_ETP!H:H, MATCH(C13, Outils_de_calcul_ETP!C:C, 0)), 0), 0)","v":0},{"$f":"IFERROR(IF(C13<>0, INDEX(Outils_de_calcul_ETP!G:G, MATCH(C13, Outils_de_calcul_ETP!C:C, 0)), IF(C13=0, 0)), 0)","v":0},{"$f":"_xlfn.IFS(Outils_de_calcul_ETP!F10=\"Atelier biomédical\",Paramétres!G$10,Outils_de_calcul_ETP!F10=\"Service de soins\",Paramétres!G$9,Outils_de_calcul_ETP!F10=\"Site extérieur\",Paramétres!G$11,Outils_de_calcul_ETP!F10=\"NON\",0,Outils_de_calcul_ETP!F10=\"\",0)*D13","v":0},{"$f":"Outils_de_calcul_ETP!J10","v":0},0,0]
[null,"Ventilation",{"$f":"IF(Outils_de_calcul_ETP!D11=\"OUI\",Outils_de_calcul_ETP!C11,0)","v":0},{"$f":"IF(C14>0,Outils_de_calcul_ETP!I11,)","v":0},{"$f":"_xlfn.IFS(Outils_de_calcul_ETP!E11=\"Externalisée\",Paramétres!G$5,Outils_de_calcul_ETP!E11=\"Internalisée\",1,Outils_de_calcul_ETP!E11=\"Partagée\",Paramétres!G$6,Outils_de_calcul_ETP!E11=\"NON\",0,Outils_de_calcul_ETP!E11=\"\",0)","v":0},{"$f":"IF(C14<>0, IFERROR(INDEX(Outils_de_calcul_ETP!H:H, MATCH(C14, Outils_de_calcul_ETP!C:C, 0)), 0), 0)","v":0},{"$f":"IFERROR(IF(C14<>0, INDEX(Outils_de_calcul_ETP!G:G, MATCH(C14, Outils_de_calcul_ETP!C:C, 0)), IF(C14=0, 0)), 0)","v":0},{"$f":"_xlfn.IFS(Outils_de_calcul_ETP!F11=\"Atelier biomédical\",Paramétres!G$10,Outils_de_calcul_ETP!F11=\"Service de soins\",Paramétres!G$9,Outils_de_calcul_ETP!F11=\"Site extérieur\",Paramétres!G$11,Outils_de_calcul_ETP!F11=\"NON\",0,Outils_de_calcul_ETP!F11=\"\",0)*D14","v":0},{"$f":"Outils_de_calcul_ETP!J11","v":0},0,0]
[null,"Ventilation",{"$f":"IF(Outils_de_calcul_ETP!D12=\"OUI\",Outils_de_calcul_ETP!C12,0)","v":0},{"$f":"IF(C15>0,Outils_de_calcul_ETP!I12,)","v":0},{"$f":"_xlfn.IFS(Outils_de_calcul_ETP!E12=\"Externalisée\",Paramétres!G$5,Outils_de_calcul_ETP!E12=\"Internalisée\",1,Outils_de_calcul_ETP!E12=\"Partagée\",Paramétres!G$6,Outils_de_calcul_ETP!E12=\"NON\",0,Outils_de_calcul_ETP!E12=\"\",0)","v":0},{"$f":"IF(C15<>0, IFERROR(INDEX(Outils_de_calcul_ETP!H:H, MATCH(C15, Outils_de_calcul_ETP!C:C, 0)), 0), 0)","v":0},{"$f":"IFERROR(IF(C15<>0, INDEX(Outils_de_calcul_ETP!G:G, MATCH(C15, Outils_de_calcul_ETP!C:C, 0)), IF(C15=0, 0)), 0)","v":0},{"$f":"_xlfn.IFS(Outils_de_calcul_ETP!F12=\"Atelier biomédical\",Paramétres!G$10,Outils_de_calcul_ETP!F12=\"Service de soins\",Paramétres!G$9,Outils_de_calcul_ETP!F12=\"Site extérieur\",Paramétres!G$11,Outils_de_calcul_ETP!F12=\"NON\",0,Outils_de_calcul_ETP!F12=\"\",0)*D15","v":0},{"$f":"Outils_de_calcul_ETP!J12","v":0},0,0]
[null,"Monitorage",{"$f":"IF(Outils_de_calcul_ETP!D13=\"OUI\",Outils_de_calcul_ETP!C13,0)","v":0},{"$f":"IF(C16>0,Outils_de_calcul_ETP!I13,)","v":0},{"$f":"_xlfn.IFS(Outils_de_calcul_ETP!E13=\"Externalisée\",Paramétres!G$5,Outils_de_calcul_ETP!E13=\"Internalisée\",1,Outils_de_calcul_ETP!E13=\"Partagée\",Paramétres!G$6,Outils_de_calcul_ETP!E13=\"NON\",0,Outils_de_calcul_ETP!E13=\"\",0)","v":0},{"$f":"IF(C16<>0, IFERROR(INDEX(Outils_de_calcul_ETP!H:H, MATCH(C16, Outils_de_calcul_ETP!C:C, 0)), 0), 0)","v":0},{"$f":"IFERROR(IF(C16<>0, INDEX(Outils_de_calcul_ETP!G:G, MATCH(C16, Outils_de_calcul_ETP!C:C, 0)), IF(C16=0, 0)), 0)","v":0},{"$f":"_xlfn.IFS(Outils_de_calcul_ETP!F13=\"Atelier biomédical\",Paramétres!G$10,Outils_de_calcul_ETP!F13=\"Service de soins\",Paramétres!G$9,Outils_de_calcul_ETP!F13=\"Site extérieur\",Paramétres!G$11,Outils_de_calcul_ETP!F13=\"NON\",0,Outils_de_calcul_ETP!F13=\"\",0)*D16","v":0},{"$f":"Outils_de_calcul_ETP!J13","v":0},0,0]
[null,"Monitorage",{"$f":"IF(Outils_de_calcul_ETP!D14=\"OUI\",Outils_de_calcul_ETP!C14,0)","v":0},{"$f":"IF(C17>0,Outils_de_calcul_ETP!I14,)","v":0},{"$f":"_xlfn.IFS(Outils_de_calcul_ETP!E14=\"Externalisée\",Paramétres!G$5,Outils_de_calcul_ETP!E14=\"Internalisée\",1,Outils_de_calcul_ETP!E14=\"Partagée\",Paramétres!G$6,Outils_de_calcul_ETP!E14=\"NON\",0,Outils_de_calcul_ETP!E14=\"\",0)","v":0},{"$f":"IF(C17<>0, IFERROR(INDEX(Outils_de_calcul_ETP!H:H, MATCH(C17, Outils_de_calcul_ETP!C:C, 0)), 0), 0)","v":0},{"$f":"IFERROR(IF(C17<>0, INDEX(Outils_de_calcul_ETP!G:G, MATCH(C17, Outils_de_calcul_ETP!C:C, 0)), IF(C17=0, 0)), 0)","v":0},{"$f":"_xlfn.IFS(Outils_de_calcul_ETP!F14=\"Atelier biomédical\",Paramétres!G$10,Outils_de_calcul_ETP!F14=\"Service de soins\",Paramétres!G$9,Outils_de_calcul_ETP!F14=\"Site extérieur\",Paramétres!G$11,Outils_de_calcul_ETP!F14=\"NON\",0,Outils_de_calcul_ETP!F14=\"\",0)*D17","v":0},{"$f":"Outils_de_calcul_ETP!J14","v":0},0,0]
[null,"Monitorage",{"$f":"IF(Outils_de_calcul_ETP!D15=\"OUI\",Outils_de_calcul_ETP!C15,0)","v":0},{"$f":"IF(C18>0,Outils_de_calcul_ETP!I15,)","v":0},{"$f":"_xlfn.IFS(Outils_de_calcul_ETP!E15=\"Externalisée\",Paramétres!G$5,Outils_de_calcul_ETP!E15=\"Internalisée\",1,Outils_de_calcul_ETP!E15=\"Partagée\",Paramétres!G$6,Outils_de_calcul_ETP!E15=\"NON\",0,Outils_de_calcul_ETP!E15=\"\",0)","v":0},{"$f":"IF(C18<>0, IFERROR(INDEX(Outils_de_calcul_ETP!H:H, MATCH(C18, Outils_de_calcul_ETP!C:C, 0)), 0), 0)","v":0},{"$f":"IFERROR(IF(C18<>0, INDEX(Outils_de_calcul_ETP!G:G, MATCH(C18, Outils_de_calcul_ETP!C:C, 0)), IF(C18=0, 0)), 0)","v":0},{"$f":"_xlfn.IFS(Outils_de_calcul_ETP!F15=\"Atelier biomédical\",Paramétres!G$10,Outils_de_calcul_ETP!F15=\"Service de soins\",Paramétres!G$9,Outils_de_calcul_ETP!F15=\"Site extérieur\",Paramétres!G$11,Outils_de_calcul_ETP!F15=\"NON\",0,Outils_de_calcul_ETP!F15=\"\",0)*D18","v":0},{"$f":"Outils_de_calcul_ETP!J15","v":0},0,0]
[null,"Monitorage",{"$f":"IF(Outils_de_calcul_ETP!D16=\"OUI\",Outils_de_calcul_ETP!C16,0)","v":0},{"$f":"IF(C19>0,Outils_de_calcul_ETP!I16,)","v":0},{"$f":"_xlfn.IFS(Outils_de_calcul_ETP!E16=\"Externalisée\",Paramétres!G$5,Outils_de_calcul_ETP!E16=\"Internalisée\",1,Outils_de_calcul_ETP!E16=\"Partagée\",Paramétres!G$6,Outils_de_calcul_ETP!E16=\"NON\",0,Outils_de_calcul_ETP!E16=\"\",0)","v":0},{"$f":"IF(C19<>0, IFERROR(INDEX(Outils_de_calcul_ETP!H:H, MATCH(C19, Outils_de_calcul_ETP!C:C, 0)), 0), 0)","v":0},{"$f":"IFERROR(IF(C19<>0, INDEX(Outils_de_calcul_ETP!G:G, MATCH(C19, Outils_de_calcul_ETP!C:C, 0)), IF(C19=0, 0)), 0)","v":0},{"$f":"_xlfn.IFS(Outils_de_calcul_ETP!F16=\"Atelier biomédical\",Paramétres!G$10,Outils_de_calcul_ETP!F16=\"Service de soins\",Paramétres!G$9,Outils_de_calcul_ETP!F16=\"Site extérieur\",Paramétres!G$11,Outils_de_calcul_ETP!F16=\"NON\",0,Outils_de_calcul_ETP!F16=\"\",0)*D19","v":0},{"$f":"Outils_de_calcul_ETP!J16","v":0},0,0]
[null,"Monitorage",{"$f":"IF(Outils_de_calcul_ETP!D17=\"OUI\",Outils_de_calcul_ETP!C17,0)","v":0},{"$f":"IF(C20>0,Outils_de_calcul_ETP!I17,)","v":0},{"$f":"_xlfn.IFS(Outils_de_calcul_ETP!E17=\"Externalisée\",Paramétres!G$5,Outils_de_calcul_ETP!E17=\"Internalisée\",1,Outils_de_calcul_ETP!E17=\"Partagée\",Paramétres!G$6,Outils_de_calcul_ETP!E17=\"NON\",0,Outils_de_calcul_ETP!E17=\"\",0)","v":0},{"$f":"IF(C20<>0, IFERROR(INDEX(Outils_de_calcul_ETP!H:H, MATCH(C20, Outils_de_calcul_ETP!C:C, 0)), 0), 0)","v":0},{"$f":"IFERROR(IF(C20<>0, INDEX(Outils_de_calcul_ETP!G:G, MATCH(C20, Outils_de_calcul_ETP!C:C, 0)), IF(C20=0, 0)), 0)","v":0},{"$f":"_xlfn.IFS(Outils_de_calcul_ETP!F17=\"Atelier biomédical\",Paramétres!G$10,Outils_de_calcul_ETP!F17=\"Service de soins\",Paramétres!G$9,Outils_de_calcul_ETP!F17=\"Site extérieur\",Paramétres!G$11,Outils_de_calcul_ETP!F17=\"NON\",0,Outils_de_calcul_ETP!F17=\"\",0)*D20","v":0},{"$f":"Outils_de_calcul_ETP!J17","v":0},0,0]
{"$rows_left_out":52}
{"sheet":"Résultats graphiques","index":5,"n_rows":20,"n_cols":16,"rows_kept":20,"cut":false,"hidden":false,"merged":[]}
[]
[]
[]
[]
[]
[null,null,null,null,null,null,null,null,null,null,null,null,null,null,"Étiquettes de lignes","Somme de Tps Total en Heures"]
[null,null,null,null,null,null,null,null,null,null,null,null,null,null,0,0]
[null,null,null,null,null,null,null,null,null,null,null,null,null,null,"(vide)"]
[null,null,null,null,null,null,null,null,null,null,null,null,null,null,"Total général",0]
[null,null,null,null,null,null,null,null,"Étiquettes de lignes","Somme de Tps Total en Heures"]
[null,null,null,null,null,null,null,null,"Chirurgie",0]
[null,null,null,null,null,null,null,null,"Dialyse",0]
[null,null,null,null,null,null,null,null,"Imagerie",0]
[null,null,null,null,null,null,null,null,"Monitorage",0]
[null,null,null,null,null,null,null,null,"Perfusion",0]
[null,null,null,null,null,null,null,null,"Thermie",0]
[null,null,null,null,null,null,null,null,"Ventilation",0]
[null,null,null,null,null,null,null,null,"(vide)",0]
[null,null,null,null,null,null,null,null,0,0]
[null,null,null,null,null,null,null,null,"Total général",0]
{"$rows_left_out":1}
{"sheet":"Feuil-cachée","index":6,"n_rows":156,"n_cols":18,"rows_kept":156,"cut":false,"hidden":true,"merged":[]}
[]
[]
[]
[null,null,null,null,null,null,null,null,null,null,null,null,null,null,null,null,null,"Temps"]
[null,null,null,null,null,null,null,null,null,null,null,null,null,null,null,null,null,0.25]
[null,null,null,null,null,null,null,null,null,null,null,null,null,null,null,null,null,0.5]
[null,null,null,null,null,null,null,null,null,null,null,1,null,null,null,null,null,0.75]
[null,"Périodicité","Tps périodicité",null,null,null,null,null,"Temps de logistique/DM",null,null,2,null,null,null,null,null,1]
[null,"1MP/3ans",0.33,null,null,null,null,null,null,null,null,3,null,null,null,null,null,1.25]
[null,"1MP/2ans",0.5,null,null,null,null,null,null,null,null,4,null,null,null,null,null,1.5]
[null,"1MP/1 an",1,null,null,null,null,null,null,null,null,5,null,null,null,null,null,1.75]
[null,"1MP/6mois",2,null,null,null,null,null,null,null,null,6,null,{"$f":"Accueil!J16","v":0},{"$f":"_xlfn.XLOOKUP(N12,J20:J31,K20:K31)","v":{"$error":"#NAME?"}},null,null,2]
[null,null,3,null,null,null,null,null,null,null,null,null,null,null,null,null,null,2.25]
[null,null,4,null,null,null,null,null,null,null,null,null,null,null,null,null,null,2.5]
[null,null,5,null,null,null,null,null,null,null,null,null,null,null,null,"Ventilation",null,2.75]
[null,null,6,null,null,null,null,null,null,null,null,null,null,null,null,"Monitorage",null,3]
[null,null,null,null,null,null,null,null,null,null,null,null,null,null,null,"Dialyse",null,3.25]
[null,null,null,null,null,null,null,null,null,"Temps de récupération moyen d'un DM",null,null,null,null,null,"Thermie",null,3.5]
[null,null,null,null,null,null,null,null,null,0,0,null,null,null,null,"Perfusion",null,3.75]
[null,null,null,null,null,null,null,null,null,"5 Minutes",8.3333333300000006E-2,null,null,null,null,"Chirurgie",null,4]
{"$rows_left_out":136}